{"text_format":"1","workbook":"xlsx","n_sheets":7,"sheets":["Dashboard1","Dashboard2","Calculation2","Calculation1","Data1","Data2","Valuation"],"not_rendered":{"charts":18,"images":0,"macros":0,"external_links":14,"defined_names":2,"comments":0,"pivot_tables":0},"unopened":[],"bounds":{"document_bytes":16777216,"sheet_cells":100000,"rows_first":2000,"rows_last":500,"rows_between":2000,"halvings":0,"cell_chars":16384,"cell_head_chars":4096},"cells_cut":0,"cells_raw":0,"read":"whole","date_system":"1900"}

{"sheet":"Dashboard1","index":0,"n_rows":31,"n_cols":28,"rows_kept":31,"cut":false,"hidden":false,"merged":[[4,3,5,3],[30,2,30,9],[1,2,1,27],[3,2,3,3],[3,4,3,6],[3,7,3,9],[3,10,3,12],[3,13,3,15],[3,16,3,18],[3,19,3,21],[3,22,3,24],[3,25,3,27]]}
[]
[null,null,"Price-Value Dashboard - Relationships"]
[]
[null,null,null,null,{"$f":"Data1!E11","v":"Financial Score"},null,null,{"$f":"Data1!F11","v":"ROE "},null,null,{"$f":"Data1!G11","v":"ROA"},null,null,{"$f":"Data1!H11","v":"EPS growth 5 Yr."},null,null,{"$f":"Data1!I11","v":"EPS growth 10 Yr."},null,null,{"$f":"Data1!J11","v":"NP margin "},null,null,{"$f":"Data1!K11","v":"Sales growth 5 Yr."},null,null,{"$f":"Data1!L11","v":"Debt/Net Profit"}]
[null,null,null,"Sort order →     ",1,null,5,2,null,5,3,null,5,4,null,5,5,null,5,6,null,5,7,null,5,8,null,5]
[null,null,null,null,{"$f":"IF(mySortCriteria =E5,CHOOSE(Calculation1!$E$8,\"È\",\"Ç\"),\"\")","v":"È"},null,null,{"$f":"IF(mySortCriteria =H5,CHOOSE(Calculation1!$E$8,\"È\",\"Ç\"),\"\")","v":""},null,null,{"$f":"IF(mySortCriteria =K5,CHOOSE(Calculation1!$E$8,\"È\",\"Ç\"),\"\")","v":""},null,null,{"$f":"IF(mySortCriteria =N5,CHOOSE(Calculation1!$E$8,\"È\",\"Ç\"),\"\")","v":""},null,null,{"$f":"IF(mySortCriteria =Q5,CHOOSE(Calculation1!$E$8,\"È\",\"Ç\"),\"\")","v":""},null,null,{"$f":"IF(mySortCriteria =T5,CHOOSE(Calculation1!$E$8,\"È\",\"Ç\"),\"\")","v":""},null,null,{"$f":"IF(mySortCriteria =W5,CHOOSE(Calculation1!$E$8,\"È\",\"Ç\"),\"\")","v":""},null,null,{"$f":"IF(mySortCriteria =Z5,CHOOSE(Calculation1!$E$8,\"È\",\"Ç\"),\"\")","v":""}]
[null,null,{"$f":"OFFSET(Calculation1!C26,Calculation1!$E$5,0,1,1)","v":1},{"$f":"OFFSET(Calculation1!J26,Calculation1!$E$5,0,1,1)","v":"Amara Raja Batt"},{"$f":"OFFSET(Calculation1!K26,Calculation1!$E$5,0,1,1)","v":49},null,null,{"$f":"OFFSET(Calculation1!L26,Calculation1!$E$5,0,1,1)","v":0.23288479473173324},null,null,{"$f":"OFFSET(Calculation1!M26,Calculation1!$E$5,0,1,1)","v":0.16794773251345113},null,null,{"$f":"OFFSET(Calculation1!N26,Calculation1!$E$5,0,1,1)","v":0.27007876481499915},null,null,{"$f":"OFFSET(Calculation1!O26,Calculation1!$E$5,0,1,1)","v":0.2719228627734831},null,null,{"$f":"OFFSET(Calculation1!P26,Calculation1!$E$5,0,1,1)","v":0.10434330276911397},null,null,{"$f":"OFFSET(Calculation1!Q26,Calculation1!$E$5,0,1,1)","v":0.21644545120282732},null,null,{"$f":"OFFSET(Calculation1!R26,Calculation1!$E$5,0,1,1)","v":0.15147924158221646}]
[null,null,{"$f":"OFFSET(Calculation1!C27,Calculation1!$E$5,0,1,1)","v":2},{"$f":"OFFSET(Calculation1!J27,Calculation1!$E$5,0,1,1)","v":"Tasty Bite"},{"$f":"OFFSET(Calculation1!K27,Calculation1!$E$5,0,1,1)","v":48},null,null,{"$f":"OFFSET(Calculation1!L27,Calculation1!$E$5,0,1,1)","v":0.26755186721991697},null,null,{"$f":"OFFSET(Calculation1!M27,Calculation1!$E$5,0,1,1)","v":0.12201029367241899},null,null,{"$f":"OFFSET(Calculation1!N27,Calculation1!$E$5,0,1,1)","v":0.53525544611561582},null,null,{"$f":"OFFSET(Calculation1!O27,Calculation1!$E$5,0,1,1)","v":0.38315787542830626},null,null,{"$f":"OFFSET(Calculation1!P27,Calculation1!$E$5,0,1,1)","v":8.2286881061766196E-2},null,null,{"$f":"OFFSET(Calculation1!Q27,Calculation1!$E$5,0,1,1)","v":0.20543164917373802},null,null,{"$f":"OFFSET(Calculation1!R27,Calculation1!$E$5,0,1,1)","v":2.5062034739454098}]
[null,null,{"$f":"OFFSET(Calculation1!C28,Calculation1!$E$5,0,1,1)","v":3},{"$f":"OFFSET(Calculation1!J28,Calculation1!$E$5,0,1,1)","v":"Britannia"},{"$f":"OFFSET(Calculation1!K28,Calculation1!$E$5,0,1,1)","v":46.5},null,null,{"$f":"OFFSET(Calculation1!L28,Calculation1!$E$5,0,1,1)","v":0.43985977851111535},null,null,{"$f":"OFFSET(Calculation1!M28,Calculation1!$E$5,0,1,1)","v":0.24194475666317833},null,null,{"$f":"OFFSET(Calculation1!N28,Calculation1!$E$5,0,1,1)","v":0.38700726807916963},null,null,{"$f":"OFFSET(Calculation1!O28,Calculation1!$E$5,0,1,1)","v":0.23994296296972806},null,null,{"$f":"OFFSET(Calculation1!P28,Calculation1!$E$5,0,1,1)","v":9.4250053473244472E-2},null,null,{"$f":"OFFSET(Calculation1!Q28,Calculation1!$E$5,0,1,1)","v":0.13479017709633467},null,null,{"$f":"OFFSET(Calculation1!R28,Calculation1!$E$5,0,1,1)","v":9.0776809195156831E-4}]
[null,null,{"$f":"OFFSET(Calculation1!C29,Calculation1!$E$5,0,1,1)","v":4},{"$f":"OFFSET(Calculation1!J29,Calculation1!$E$5,0,1,1)","v":"Marico"},{"$f":"OFFSET(Calculation1!K29,Calculation1!$E$5,0,1,1)","v":46},null,null,{"$f":"OFFSET(Calculation1!L29,Calculation1!$E$5,0,1,1)","v":0.35130005150607591},null,null,{"$f":"OFFSET(Calculation1!M29,Calculation1!$E$5,0,1,1)","v":0.21263170048783309},null,null,{"$f":"OFFSET(Calculation1!N29,Calculation1!$E$5,0,1,1)","v":0.19823954638325181},null,null,{"$f":"OFFSET(Calculation1!O29,Calculation1!$E$5,0,1,1)","v":0.2256287837812001},null,null,{"$f":"OFFSET(Calculation1!P29,Calculation1!$E$5,0,1,1)","v":0.12012641796204855},null,null,{"$f":"OFFSET(Calculation1!Q29,Calculation1!$E$5,0,1,1)","v":0.14359899192350989},null,null,{"$f":"OFFSET(Calculation1!R29,Calculation1!$E$5,0,1,1)","v":0.45080231326871373}]
{"$rows_left_out":22}
{"sheet":"Dashboard2","index":1,"n_rows":31,"n_cols":28,"rows_kept":31,"cut":false,"hidden":false,"merged":[[4,3,5,3],[30,2,30,9],[1,2,1,27],[3,2,3,3],[3,4,3,6],[3,7,3,9],[3,10,3,12],[3,13,3,15],[3,16,3,18],[3,19,3,21],[3,22,3,24],[3,25,3,27]]}
[]
[null,null,"Price-Value Dashboard - Relationships"]
[]
[null,null,null,null,{"$f":"Data2!E11","v":"Total Score"},null,null,{"$f":"Data2!F11","v":"Promoter Pledge%"},null,null,{"$f":"Data2!G11","v":"Promoter Holding 5 Yr."},null,null,{"$f":"Data2!H11","v":"CFO/PAT 5 Yr."},null,null,{"$f":"Data2!I11","v":"Current ratio"},null,null,{"$f":"Data2!J11","v":"Current Cash flow"},null,null,{"$f":"Data2!K11","v":"BVPS 5 Yr."},null,null,{"$f":"Data2!L11","v":"Receivables/\nSales"}]
[null,null,null,"Sort order →     ",1,null,5,2,null,5,3,null,5,4,null,5,5,null,5,6,null,5,7,null,5,8,null,5]
[null,null,null,null,{"$f":"IF(mySortCriteria1 =E5,CHOOSE(Calculation2!$E$8,\"È\",\"Ç\"),\"\")","v":"È"},null,null,{"$f":"IF(mySortCriteria1 =H5,CHOOSE(Calculation2!$E$8,\"È\",\"Ç\"),\"\")","v":""},null,null,{"$f":"IF(mySortCriteria1 =K5,CHOOSE(Calculation2!$E$8,\"È\",\"Ç\"),\"\")","v":""},null,null,{"$f":"IF(mySortCriteria1 =N5,CHOOSE(Calculation2!$E$8,\"È\",\"Ç\"),\"\")","v":""},null,null,{"$f":"IF(mySortCriteria1 =Q5,CHOOSE(Calculation2!$E$8,\"È\",\"Ç\"),\"\")","v":""},null,null,{"$f":"IF(mySortCriteria1 =T5,CHOOSE(Calculation2!$E$8,\"È\",\"Ç\"),\"\")","v":""},null,null,{"$f":"IF(mySortCriteria1 =W5,CHOOSE(Calculation2!$E$8,\"È\",\"Ç\"),\"\")","v":""},null,null,{"$f":"IF(mySortCriteria1 =Z5,CHOOSE(Calculation2!$E$8,\"È\",\"Ç\"),\"\")","v":""}]
[null,null,{"$f":"OFFSET(Calculation2!C26,Calculation2!$E$5,0,1,1)","v":1},{"$f":"OFFSET(Calculation2!J26,Calculation2!$E$5,0,1,1)","v":"Tasty Bite"},{"$f":"OFFSET(Calculation2!K26,Calculation2!$E$5,0,1,1)","v":87},null,null,{"$f":"OFFSET(Calculation2!L26,Calculation2!$E$5,0,1,1)","v":0},null,null,{"$f":"OFFSET(Calculation2!M26,Calculation2!$E$5,0,1,1)","v":1.7134568699457287E-3},null,null,{"$f":"OFFSET(Calculation2!N26,Calculation2!$E$5,0,1,1)","v":1.4574196838347786},null,null,{"$f":"OFFSET(Calculation2!O26,Calculation2!$E$5,0,1,1)","v":2.1852557991738162},null,null,{"$f":"OFFSET(Calculation2!P26,Calculation2!$E$5,0,1,1)","v":1},null,null,{"$f":"OFFSET(Calculation2!Q26,Calculation2!$E$5,0,1,1)","v":0.2177409386677529},null,null,{"$f":"OFFSET(Calculation2!R26,Calculation2!$E$5,0,1,1)","v":0.11904032669729453}]
[null,null,{"$f":"OFFSET(Calculation2!C27,Calculation2!$E$5,0,1,1)","v":2},{"$f":"OFFSET(Calculation2!J27,Calculation2!$E$5,0,1,1)","v":"Amara Raja Batt"},{"$f":"OFFSET(Calculation2!K27,Calculation2!$E$5,0,1,1)","v":87},null,null,{"$f":"OFFSET(Calculation2!L27,Calculation2!$E$5,0,1,1)","v":0},null,null,{"$f":"OFFSET(Calculation2!M27,Calculation2!$E$5,0,1,1)","v":0},null,null,{"$f":"OFFSET(Calculation2!N27,Calculation2!$E$5,0,1,1)","v":1.0719696097617133},null,null,{"$f":"OFFSET(Calculation2!O27,Calculation2!$E$5,0,1,1)","v":1.9796874576822034},null,null,{"$f":"OFFSET(Calculation2!P27,Calculation2!$E$5,0,1,1)","v":1},null,null,{"$f":"OFFSET(Calculation2!Q27,Calculation2!$E$5,0,1,1)","v":0.26611913973007151},null,null,{"$f":"OFFSET(Calculation2!R27,Calculation2!$E$5,0,1,1)","v":0.12623996145539976}]
[null,null,{"$f":"OFFSET(Calculation2!C28,Calculation2!$E$5,0,1,1)","v":3},{"$f":"OFFSET(Calculation2!J28,Calculation2!$E$5,0,1,1)","v":"Britannia"},{"$f":"OFFSET(Calculation2!K28,Calculation2!$E$5,0,1,1)","v":84.5},null,null,{"$f":"OFFSET(Calculation2!L28,Calculation2!$E$5,0,1,1)","v":0},null,null,{"$f":"OFFSET(Calculation2!M28,Calculation2!$E$5,0,1,1)","v":-1.0810295393128833E-3},null,null,{"$f":"OFFSET(Calculation2!N28,Calculation2!$E$5,0,1,1)","v":1.1518358511337043},null,null,{"$f":"OFFSET(Calculation2!O28,Calculation2!$E$5,0,1,1)","v":1.0681762686545726},null,null,{"$f":"OFFSET(Calculation2!P28,Calculation2!$E$5,0,1,1)","v":1},null,null,{"$f":"OFFSET(Calculation2!Q28,Calculation2!$E$5,0,1,1)","v":0.30307665589770849},null,null,{"$f":"OFFSET(Calculation2!R28,Calculation2!$E$5,0,1,1)","v":1.342492985568515E-2}]
[null,null,{"$f":"OFFSET(Calculation2!C29,Calculation2!$E$5,0,1,1)","v":4},{"$f":"OFFSET(Calculation2!J29,Calculation2!$E$5,0,1,1)","v":"Marico"},{"$f":"OFFSET(Calculation2!K29,Calculation2!$E$5,0,1,1)","v":84},null,null,{"$f":"OFFSET(Calculation2!L29,Calculation2!$E$5,0,1,1)","v":0},null,null,{"$f":"OFFSET(Calculation2!M29,Calculation2!$E$5,0,1,1)","v":-1.1062169169399838E-2},null,null,{"$f":"OFFSET(Calculation2!N29,Calculation2!$E$5,0,1,1)","v":1.1697808761039414},null,null,{"$f":"OFFSET(Calculation2!O29,Calculation2!$E$5,0,1,1)","v":1.9001439071267832},null,null,{"$f":"OFFSET(Calculation2!P29,Calculation2!$E$5,0,1,1)","v":1},null,null,{"$f":"OFFSET(Calculation2!Q29,Calculation2!$E$5,0,1,1)","v":0.17460657647505817},null,null,{"$f":"OFFSET(Calculation2!R29,Calculation2!$E$5,0,1,1)","v":4.1164115041650087E-2}]
{"$rows_left_out":22}
{"sheet":"Calculation2","index":2,"n_rows":126,"n_cols":68,"rows_kept":126,"cut":false,"hidden":false,"merged":[[24,44,24,48],[24,49,24,53],[24,54,24,58],[2,2,2,67],[22,2,22,7],[22,9,22,14],[22,19,22,45],[22,63,22,67],[24,19,24,23],[24,24,24,28],[24,29,24,33],[24,34,24,38],[24,39,24,43]]}
[]
[]
[null,null,"Calculation"]
[]
[null,null,null,"Actual Position",1]
[null,null,null,"Maximum Position",{"$f":"$C$38-COUNTA(Dashboard2!$D$7:$D$18)+1","v":1}]
[null,null,null,"Sort by",1]
[null,null,null,"Sort Order",1]
[]
[null,null,null,"Input List",{"$f":"TRANSPOSE(Data2!E11:L11)","v":"Total Score"}]
{"$rows_left_out":117}
{"sheet":"Calculation1","index":3,"n_rows":126,"n_cols":68,"rows_kept":126,"cut":false,"hidden":false,"merged":[[24,44,24,48],[24,49,24,53],[24,54,24,58],[2,2,2,67],[22,2,22,7],[22,9,22,14],[22,19,22,45],[22,63,22,67],[24,19,24,23],[24,24,24,28],[24,29,24,33],[24,34,24,38],[24,39,24,43]]}
[]
[]
[null,null,"Calculation"]
[]
[null,null,null,"Actual Position",1]
[null,null,null,"Maximum Position",{"$f":"$C$38-COUNTA(Dashboard1!$D$7:$D$18)+1","v":1}]
[null,null,null,"Sort by",1]
[null,null,null,"Sort Order",1]
[]
[null,null,null,"Input List",{"$f":"TRANSPOSE(Data1!E11:L11)","v":"Financial Score"}]
{"$rows_left_out":117}
{"sheet":"Data1","index":4,"n_rows":32,"n_cols":12,"rows_kept":32,"cut":false,"hidden":false,"merged":[[2,2,2,8]]}
[]
[]
[null,null,"Data"]
[]
[null,null,null,"Quantile for highlighting  green",0.9]
[null,null,null,"Quantile for highlighting red",0.1]
[]
[null,null,null,null,"Financial Score","ROE ","ROA","EPS growth 5 Yr.","EPS growth 10 Yr.","NP margin ","Sales growth 5 Yr.","Debt/Net Profit"]
[null,null,null,"Targets",{"$f":"AVERAGE(E12:E10000)","v":42.357142857142854},{"$f":"AVERAGE(F12:F10000)","v":0.30335474994575484},{"$f":"AVERAGE(G12:G10000)","v":0.17008059924560309},{"$f":"AVERAGE(H12:H10000)","v":0.24418749347517915},{"$f":"AVERAGE(I12:I10000)","v":0.27398131956211624},0.11011063753201035,0.16268159205862517,0.81467354350903265]
[]
{"$rows_left_out":23}
{"sheet":"Data2","index":5,"n_rows":32,"n_cols":12,"rows_kept":32,"cut":false,"hidden":false,"merged":[[2,2,2,8]]}
[]
[]
[null,null,"Data"]
[]
[null,null,null,"Quantile for highlighting  green",0.9]
[null,null,null,"Quantile for highlighting red",0.1]
[]
[null,null,null,null,"Total Score","Promoter Pledge%","Promoter Holding 5 Yr.","CFO/PAT 5 Yr.","Current ratio","Current Cash flow","BVPS 5 Yr.",{"$f":"[1]Analysis!$H$2","v":"Receivables/\nSales"}]
[null,null,null,"Targets",{"$f":"AVERAGE(E12:E10000)","v":80.285714285714292},{"$f":"AVERAGE(F12:F10000)","v":1.5142857142857142E-2},{"$f":"AVERAGE(G12:G10000)","v":-7.7450810853494844E-3},{"$f":"AVERAGE(H12:H10000)","v":1.1393839131178642},{"$f":"AVERAGE(I12:I10000)","v":1.5769788472128059},1,0.22649145779635213,7.6390151543915694E-2]
[]
{"$rows_left_out":23}
{"sheet":"Valuation","index":6,"n_rows":23,"n_cols":6,"rows_kept":23,"cut":false,"hidden":false,"merged":[]}
[]
[null,null,"No.","Sherwood Segment","Distance Covered","Distance Left"]
[null,null,1,{"$f":"[1]Qualitative!$D$2","v":"Britannia"},{"$f":"[1]Dashboard!$K$6","v":0.45749257334676435},{"$f":"[1]Dashboard!$K$7","v":0.12238842703295205}]
[null,null,{"$f":"C3+1","v":2},{"$f":"[2]Qualitative!$D$2","v":"Marico"},{"$f":"[2]Dashboard!$K$6","v":0.29263597998121438},{"$f":"[2]Dashboard!$K$7","v":0.14851834106401385}]
[null,null,{"$f":"C4+1","v":3},{"$f":"[3]Qualitative!$D$2","v":"Dabur India"},{"$f":"[3]Dashboard!$K$6","v":6.5541708768851181E-2},{"$f":"[3]Dashboard!$K$7","v":0.1637616573103049}]
[null,null,4,{"$f":"[4]Qualitative!$D$2","v":"Mayur Uniquoter"},{"$f":"[4]Dashboard!$K$6","v":0.37693490180771622},{"$f":"[4]Dashboard!$K$7","v":0.13672592629944003}]
[null,null,5,{"$f":"[5]Qualitative!$D$2","v":"Titan Company"},{"$f":"[5]Dashboard!$K$6","v":0.41883514030132551},{"$f":"[5]Dashboard!$K$7","v":3.6198132898048963E-2}]
[null,null,6,{"$f":"[6]Qualitative!$D$2","v":"Amara Raja Batt"},{"$f":"[6]Dashboard!$K$6","v":0.56256681160604149},{"$f":"[6]Dashboard!$K$7","v":0.10311771553210147}]
[null,null,7,{"$f":"[7]Qualitative!$D$2","v":"Pidilite Ind"},{"$f":"[7]Dashboard!$K$6","v":0.19527509641617802},{"$f":"[7]Dashboard!$K$7","v":0.15716796409914346}]
[null,null,8,{"$f":"[8]Qualitative!$D$2","v":"Colgate"},{"$f":"[8]Dashboard!$K$6","v":0.15705122731613153},{"$f":"[8]Dashboard!$K$7","v":5.9852616101919942E-2}]
{"$rows_left_out":13}